BDBM343677 3-(1-Benzofuran-2-yl)-6-{2-[(3R)-morpholin-3-yl]ethoxy}imidazo[1,2-b]pyridazine::US9777004, 8
SMILES C(C[C@@H]1COCCN1)Oc1ccc2ncc(-c3cc4ccccc4o3)n2n1
InChI Key InChIKey=FCVZAGHPGIACKM-OAHLLOKOSA-N
Data  2 IC50
  Tab Delimited (TSV)   2D SDfile   Computed 3D by Vconf -m prep SDfile
Find this compound or compounds like it in BindingDB:
Activity Spreadsheet -- Enzyme Inhibition Constant Data from BindingDB
Found 2 hits for monomerid = 343677
TargetIsoform 2 of MAP kinase-interacting serine/threonine-protein kinase 1 (MNK1a) 344D](Homo sapiens (Human))
Bayer Intellectual Property
US Patent
LigandPNGBDBM343677(3-(1-Benzofuran-2-yl)-6-{2-[(3R)-morpholin-3-yl]et...)
Affinity DataIC50:  20nM. Assay description: For the assay 50 nL of a 100fold concentrated solution of the test compound in DMSO was pipetted into a black low volume 384well microtiter plate (Gr...
Ligand InfoPC cidPC sid
In DepthDetails US Patent
TargetIsoform 2 of MAP kinase-interacting serine/threonine-protein kinase 1 (MNK1a) 344D](Homo sapiens (Human))
Bayer Intellectual Property
US Patent
LigandPNGBDBM343677(3-(1-Benzofuran-2-yl)-6-{2-[(3R)-morpholin-3-yl]et...)
Affinity DataIC50:  6nM. Assay description: For the assay 50 nL of a 100fold concentrated solution of the test compound in DMSO was pipetted into a black low volume 384well microtiter plate (Gr...
Ligand InfoPC cidPC sid
In DepthDetails US Patent