BDBM343778 1-(3,4-dihydroisoquinolin-2(1H)-yl)-3-((3′-(hydroxymethyl)-[1,1′-biphenyl]-3-yl)oxy)propan-2-ol::US9777008, Compound 72
SMILES OCc1cccc(c1)-c1cccc(OCC(O)CN2CCc3ccccc3C2)c1
InChI Key InChIKey=CLOWIJOJEXRSDS-UHFFFAOYSA-N
Data  1 IC50
  Tab Delimited (TSV)   2D SDfile   Computed 3D by Vconf -m prep SDfile
Find this compound or compounds like it in BindingDB:
Activity Spreadsheet -- Enzyme Inhibition Constant Data from BindingDB
Found 1 hit for monomerid = 343778
TargetMethylosome protein 50/Protein arginine N-methyltransferase 5(Homo sapiens (Human))
Epizyme
US Patent
LigandPNGBDBM343778(1-(3,4-dihydroisoquinolin-2(1H)-yl)-3-((3′-(...)
Affinity DataIC50:  550nM. Assay description: The assays were all performed in a buffer consisting of 20 mM Bicine (pH=7.6), 1 mM TCEP, 0.005% BSG, and 0.002% Tween20, prepared on the day of use....
Ligand InfoPC cidPC sid
In DepthDetails US Patent