BDBM343916 1-(3,4-dihydroisoquinolin-2(1H)-yl)-3-(3-(2-methyl-2H-pyrazolo[3,4-b]pyridin-6-yl)phenoxy)propan-2-ol::US9777008, Compound 210
SMILES Cn1cc2ccc(nc2n1)-c1cccc(OCC(O)CN2CCc3ccccc3C2)c1
InChI Key InChIKey=VFVDOVAAMDWKIO-UHFFFAOYSA-N
Data  1 IC50
  Tab Delimited (TSV)   2D SDfile   Computed 3D by Vconf -m prep SDfile
Find this compound or compounds like it in BindingDB:
Activity Spreadsheet -- Enzyme Inhibition Constant Data from BindingDB
Found 1 hit for monomerid = 343916
TargetMethylosome protein 50/Protein arginine N-methyltransferase 5(Homo sapiens (Human))
Epizyme
US Patent
LigandPNGBDBM343916(1-(3,4-dihydroisoquinolin-2(1H)-yl)-3-(3-(2-methyl...)
Affinity DataIC50: <100nM. Assay description: The assays were all performed in a buffer consisting of 20 mM Bicine (pH=7.6), 1 mM TCEP, 0.005% BSG, and 0.002% Tween20, prepared on the day of use....
Ligand InfoPC cidPC sid
In DepthDetails US Patent