BDBM343979 N-(3-(3,4-dihydroisoquinolin-2(1H)-yl)-2-hydroxypropyl)-N-(3-(1-methyl-1H-benzo[d]imidazol-6-yl)phenyl)acetamide::US9777008, Compound 273
SMILES CC(=O)N(CC(O)CN1CCc2ccccc2C1)c1cccc(c1)-c1ccc2ncn(C)c2c1
InChI Key InChIKey=VAIDSUPAVKELPW-UHFFFAOYSA-N
Data  1 IC50
  Tab Delimited (TSV)   2D SDfile   Computed 3D by Vconf -m prep SDfile
Find this compound or compounds like it in BindingDB:
Activity Spreadsheet -- Enzyme Inhibition Constant Data from BindingDB
Found 1 hit for monomerid = 343979
TargetMethylosome protein 50/Protein arginine N-methyltransferase 5(Homo sapiens (Human))
Epizyme
US Patent
LigandPNGBDBM343979(N-(3-(3,4-dihydroisoquinolin-2(1H)-yl)-2-hydroxypr...)
Affinity DataIC50: <100nM. Assay description: The assays were all performed in a buffer consisting of 20 mM Bicine (pH=7.6), 1 mM TCEP, 0.005% BSG, and 0.002% Tween20, prepared on the day of use....
Ligand InfoPC cidPC sid
In DepthDetails US Patent