BDBM344064 US10370387, Example 48::US11161855, Example 48::US9777017, Example 48::US9908895, Example 48
SMILES Cc1nc2cnc3ccsc3c2n1[C@H]1CC[C@H](CC#N)CC1
InChI Key InChIKey=WWPGFKUUOGXVCY-JOCQHMNTSA-N
Data  8 IC50
  Tab Delimited (TSV)   2D SDfile   Computed 3D by Vconf -m prep SDfile
Find this compound or compounds like it in BindingDB:
Activity Spreadsheet -- Enzyme Inhibition Constant Data from BindingDB
Found 8 hits for monomerid = 344064
TargetTyrosine-protein kinase JAK1(Homo sapiens (Human))
Incyte Holdings
US Patent
LigandPNGBDBM344064(US10370387, Example 48 | US11161855, Example 48 | ...)
Affinity DataIC50: <100nM. Assay description: Compounds herein were tested for inhibitory activity of JAK targets according to the following in vitro assay described in Park et al., Analytical Bi...
Ligand InfoPC cidPC sid
In DepthDetails US Patent
TargetTyrosine-protein kinase JAK2(Homo sapiens (Human))
Incyte Holdings
US Patent
LigandPNGBDBM344064(US10370387, Example 48 | US11161855, Example 48 | ...)
Affinity DataIC50: <100nM. Assay description: Compounds herein were tested for inhibitory activity of JAK targets according to the following in vitro assay described in Park et al., Analytical Bi...
Ligand InfoPC cidPC sid
In DepthDetails US Patent
TargetTyrosine-protein kinase JAK1(Homo sapiens (Human))
Incyte Holdings
US Patent
LigandPNGBDBM344064(US10370387, Example 48 | US11161855, Example 48 | ...)
Affinity DataIC50: <100nM. Assay description: Compounds herein were tested for inhibitory activity of JAK targets according to the following in vitro assay described in Park et al., Analytical Bi...
Ligand InfoPC cidPC sid
In DepthDetails US Patent
TargetTyrosine-protein kinase JAK2 [828-1132](Homo sapiens (Human))
Incyte
US Patent
LigandPNGBDBM344064(US10370387, Example 48 | US11161855, Example 48 | ...)
Affinity DataIC50: <100nM. Assay description: Compounds herein were tested for inhibitory activity of JAK targets according to the following in vitro assay described in Park et al., Analytical Bi...
Ligand InfoPC cidPC sid
In DepthDetails US Patent
TargetTyrosine-protein kinase JAK1 [837-1142](Homo sapiens (Human))
Incyte Holdings
US Patent
LigandPNGBDBM344064(US10370387, Example 48 | US11161855, Example 48 | ...)
Affinity DataIC50: <100nM. Assay description: Compounds herein were tested for inhibitory activity of JAK targets according to the following in vitro assay described in Park et al., Analytical Bi...
Ligand InfoPC cidPC sid
In DepthDetails US Patent
TargetTyrosine-protein kinase JAK2 [828-1132](Homo sapiens (Human))
Incyte
US Patent
LigandPNGBDBM344064(US10370387, Example 48 | US11161855, Example 48 | ...)
Affinity DataIC50: <100nM. Assay description: Compounds herein were tested for inhibitory activity of JAK targets according to the following in vitro assay described in Park et al., Analytical Bi...
Ligand InfoPC cidPC sid
In DepthDetails US Patent
TargetTyrosine-protein kinase JAK1 [837-1142](Homo sapiens (Human))
Incyte Holdings
US Patent
LigandPNGBDBM344064(US10370387, Example 48 | US11161855, Example 48 | ...)
Affinity DataIC50: <100nM. Assay description: Compounds herein were tested for inhibitory activity of JAK targets according to the following in vitro assay described in Park et al., Analytical Bi...
Ligand InfoPC cidPC sid
In DepthDetails US Patent
TargetTyrosine-protein kinase JAK2(Homo sapiens (Human))
Incyte Holdings
US Patent
LigandPNGBDBM344064(US10370387, Example 48 | US11161855, Example 48 | ...)
Affinity DataIC50: <100nM. Assay description: Compounds herein were tested for inhibitory activity of JAK targets according to the following in vitro assay described in Park et al., Analytical Bi...
Ligand InfoPC cidPC sid
In DepthDetails US Patent