BDBM344145 N-(4-cyanophenyl)-4-oxo-4,5,6,7-tetrahydrofuro[3,2-c]pyridine-3-carboxamide::US9777020, Example 39
SMILES O=C(Nc1ccc(cc1)C#N)c1coc2CCNC(=O)c12
InChI Key InChIKey=BVZYDNHNNPVFEW-UHFFFAOYSA-N
Data  1 IC50
  Tab Delimited (TSV)   2D SDfile   Computed 3D by Vconf -m prep SDfile
Find this compound or compounds like it in BindingDB:
Activity Spreadsheet -- Enzyme Inhibition Constant Data from BindingDB
Found 1 hit for monomerid = 344145
TargetHigh affinity nerve growth factor receptor(Homo sapiens (Human))
Abbvie
US Patent
LigandPNGBDBM344145(N-(4-cyanophenyl)-4-oxo-4,5,6,7-tetrahydrofuro[3,2...)
Affinity DataIC50:  430nM
Ligand InfoPC cidPC sid
In DepthDetails US Patent