BDBM344160 4-oxo-N-{1-[2-(pyrrolidin-1-yl)ethyl]-1H-indazol-5-yl}-4,5,6,7-tetrahydrofuro[3,2-c]pyridine-3-carboxamide::US9777020, Example 54
SMILES O=C(Nc1ccc2n(CCN3CCCC3)ncc2c1)c1coc2CCNC(=O)c12
InChI Key InChIKey=SSUYPROGJPXCPU-UHFFFAOYSA-N
Data  1 IC50
  Tab Delimited (TSV)   2D SDfile   Computed 3D by Vconf -m prep SDfile
Find this compound or compounds like it in BindingDB:
Activity Spreadsheet -- Enzyme Inhibition Constant Data from BindingDB
Found 1 hit for monomerid = 344160
TargetHigh affinity nerve growth factor receptor(Homo sapiens (Human))
Abbvie
US Patent
LigandPNGBDBM344160(4-oxo-N-{1-[2-(pyrrolidin-1-yl)ethyl]-1H-indazol-5...)
Affinity DataIC50:  108nM
Ligand InfoPC cidPC sid
In DepthDetails US Patent