BDBM344183 N-(6-chloro-1H-indazol-5-yl)-5-methyl-4-oxo-4,5,6,7-tetrahydrofuro[3,2-c]pyridine-3-carboxamide::US9777020, Example 77
SMILES CN1CCc2occ(C(=O)Nc3cc4cn[nH]c4cc3Cl)c2C1=O
InChI Key InChIKey=RVBZXBGEQVDKRW-UHFFFAOYSA-N
Data  1 IC50
  Tab Delimited (TSV)   2D SDfile   Computed 3D by Vconf -m prep SDfile
Find this compound or compounds like it in BindingDB:
Activity Spreadsheet -- Enzyme Inhibition Constant Data from BindingDB
Found 1 hit for monomerid = 344183
TargetHigh affinity nerve growth factor receptor(Homo sapiens (Human))
Abbvie
US Patent
LigandPNGBDBM344183(N-(6-chloro-1H-indazol-5-yl)-5-methyl-4-oxo-4,5,6,...)
Affinity DataIC50:  367nM
Ligand InfoPC cidPC sid
In DepthDetails US Patent