BDBM344251 6-ethoxy-5-({[5-(2-methoxyethyl)-6,6-dimethyl-4-oxo-4,5,6,7-tetrahydrofuro[3,2-c]pyridin-3-yl]carbonyl}amino)pyridine-2-carboxylic acid::US9777020, Example 145
SMILES CCOc1nc(ccc1NC(=O)c1coc2CC(C)(C)N(CCOC)C(=O)c12)C(O)=O
InChI Key InChIKey=JYDUWDRHKRYRIT-UHFFFAOYSA-N
Data  1 IC50
  Tab Delimited (TSV)   2D SDfile   Computed 3D by Vconf -m prep SDfile
Find this compound or compounds like it in BindingDB:
Activity Spreadsheet -- Enzyme Inhibition Constant Data from BindingDB
Found 1 hit for monomerid = 344251
TargetHigh affinity nerve growth factor receptor(Homo sapiens (Human))
Abbvie
US Patent
LigandPNGBDBM344251(6-ethoxy-5-({[5-(2-methoxyethyl)-6,6-dimethyl-4-ox...)
Affinity DataIC50:  7.90nM
Ligand InfoPC cidPC sid
In DepthDetails US Patent