BDBM344287 N-{6-(4-acetylpiperazin-1-yl)-2-[(3S)-tetrahydrofuran-3-yloxy]pyridin-3-yl}-6,6-dimethyl-4-oxo-4,5,6,7-tetrahydrofuro[3,2-c]pyridine-3-carboxamide::US9777020, Example 181
SMILES CC(=O)N1CCN(CC1)c1ccc(NC(=O)c2coc3CC(C)(C)NC(=O)c23)c(O[C@H]2CCOC2)n1
InChI Key InChIKey=QUEOXNKWNPVBDQ-INIZCTEOSA-N
Data  1 IC50
  Tab Delimited (TSV)   2D SDfile   Computed 3D by Vconf -m prep SDfile
Find this compound or compounds like it in BindingDB:
Activity Spreadsheet -- Enzyme Inhibition Constant Data from BindingDB
Found 1 hit for monomerid = 344287
TargetHigh affinity nerve growth factor receptor(Homo sapiens (Human))
Abbvie
US Patent
LigandPNGBDBM344287(N-{6-(4-acetylpiperazin-1-yl)-2-[(3S)-tetrahydrofu...)
Affinity DataIC50:  10.2nM
Ligand InfoPC cidPC sid
In DepthDetails US Patent