BDBM344307 (1s,4s)-4-(5- Fluoropyridin-3-yl)-N- hydroxy-1- phenylcyclohexanecarboxamide::US9783488, Example 14
SMILES ONC(=O)[C@@]1(CC[C@@H](CC1)c1cncc(F)c1)c1ccccc1
InChI Key InChIKey=CPUCNCCKUXGHIN-QGGXVJLZSA-N
Data  1 IC50
  Tab Delimited (TSV)   2D SDfile   Computed 3D by Vconf -m prep SDfile
Find this compound or compounds like it in BindingDB:
Activity Spreadsheet -- Enzyme Inhibition Constant Data from BindingDB
Found 1 hit for monomerid = 344307
TargetHistone deacetylase 4(Homo sapiens (Human))
Chdi Foundation
US Patent
LigandPNGBDBM344307((1s,4s)-4-(5- Fluoropyridin-3-yl)-N- hydroxy-1- ph...)
Affinity DataIC50: >5.00E+4nM. Assay description: The potency of Class IIa Histone Deacetylase (HDAC) inhibitors is quantified by measuring the Histone Deacetylase 4 (HDAC4) catalytic domain enzymati...
Ligand InfoPC cidPC sid
In DepthDetails US Patent