BDBM344323 1-(3,4-Difluoro-2-methylphenyl)-N- hydroxycyclopentanecarboxamide::US9783488, Example 29
SMILES Cc1c(F)c(F)ccc1C1(CCCC1)C(=O)NO
InChI Key InChIKey=LPGDISHQDPWDKY-UHFFFAOYSA-N
Data  1 IC50
  Tab Delimited (TSV)   2D SDfile   Computed 3D by Vconf -m prep SDfile
Find this compound or compounds like it in BindingDB:
Activity Spreadsheet -- Enzyme Inhibition Constant Data from BindingDB
Found 1 hit for monomerid = 344323
TargetHistone deacetylase 4(Homo sapiens (Human))
Chdi Foundation
US Patent
LigandPNGBDBM344323(1-(3,4-Difluoro-2-methylphenyl)-N- hydroxycyclopen...)
Affinity DataIC50:  150nM. Assay description: The potency of Class IIa Histone Deacetylase (HDAC) inhibitors is quantified by measuring the Histone Deacetylase 4 (HDAC4) catalytic domain enzymati...
Ligand InfoPC cidPC sid
In DepthDetails US Patent