BDBM34457 3-(phenoxymethyl)-6-(phenylmethyl)-[1,2,4]triazolo[3,4-b][1,3,4]thiadiazole::6-benzyl-3-(phenoxymethyl)-[1,2,4]triazolo[3,4-b][1,3,4]thiadiazole::6-benzyl-3-(phenoxymethyl)[1,2,4]triazolo[3,4-b][1,3,4]thiadiazole::MLS000064648::SMR000077366::cid_972347
SMILES C(Oc1ccccc1)c1nnc2sc(Cc3ccccc3)nn12
InChI Key InChIKey=IYZLXVDKRBIHNG-UHFFFAOYSA-N
Data  2 IC50
  Tab Delimited (TSV)   2D SDfile   Computed 3D by Vconf -m prep SDfile
Find this compound or compounds like it in BindingDB:
Activity Spreadsheet -- Enzyme Inhibition Constant Data from BindingDB
Found 2 hits for monomerid = 34457
TargetComplement C1s subcomponent(Homo sapiens (Human))
Pcmd
Curated by PubChem BioAssay
LigandPNGBDBM34457(3-(phenoxymethyl)-6-(phenylmethyl)-[1,2,4]triazolo...)
Affinity DataIC50: >5.00E+4nM. Assay description: Molecular Library Screening Center Network (MLSCN) Penn Center for Molecular Discovery (PCMD) Assay Provider: Dr. Scott L. Diamond, University of Pen...
In DepthDetails PCBioAssay
TargetGag-Pol polyprotein(Human immunodeficiency virus type 1 group M subtyp...)
University Of Pittsburgh
Curated by PubChem BioAssay
LigandPNGBDBM34457(3-(phenoxymethyl)-6-(phenylmethyl)-[1,2,4]triazolo...)
Affinity DataIC50:  1.36E+3nMpH: 8.0 T: 2°C. Assay description: A fluorescence resonance energy transfer assay is developed in 96-well and 384-well microplate formats with robotic manipulation to enable high-throu...
In DepthDetails PCBioAssay