BDBM344735 1-[1-(2,4-difluorophenyl)-1H-indazol-4-yl]-3-(1,3-oxazol-4-ylmethyl)imidazolidin-2-one::US9783527, Example 37
SMILES Fc1ccc(c(F)c1)-n1ncc2c(cccc12)N1CCN(Cc2cocn2)C1=O
InChI Key InChIKey=JYQHRPHJCGJKPU-UHFFFAOYSA-N
Data  1 IC50
  Tab Delimited (TSV)   2D SDfile   Computed 3D by Vconf -m prep SDfile
Find this compound or compounds like it in BindingDB:
Activity Spreadsheet -- Enzyme Inhibition Constant Data from BindingDB
Found 1 hit for monomerid = 344735
TargetSodium channel protein type 9 subunit alpha(Homo sapiens (Human))
Abbvie
US Patent
LigandPNGBDBM344735(1-[1-(2,4-difluorophenyl)-1H-indazol-4-yl]-3-(1,3-...)
Affinity DataIC50:  392nM. Assay description: Two days prior to the experiment, frozen HEK293 cells stably expressing recombinant human Nav1.7 were quickly thawed and plated at 25,000 cells/well ...
Ligand InfoPC cidPC sid
In DepthDetails US Patent