BDBM344827 1-[1-(2-fluorophenyl)-1H-::1-[1-(2-fluorophenyl)-1H-indazol-4-yl]-3-[2-oxo-2-(2-phenylpyrrolidin-1-yl)ethyl]imidazolidin-2-one::US9783527, Example 129
SMILES Fc1ccccc1-n1ncc2c(cccc12)N1CCN(CC(=O)N2CCCC2c2ccccc2)C1=O
InChI Key InChIKey=PVBPVBVGMPBVTO-UHFFFAOYSA-N
Data  1 IC50
  Tab Delimited (TSV)   2D SDfile   Computed 3D by Vconf -m prep SDfile
Find this compound or compounds like it in BindingDB:
Activity Spreadsheet -- Enzyme Inhibition Constant Data from BindingDB
Found 1 hit for monomerid = 344827
TargetSodium channel protein type 9 subunit alpha(Homo sapiens (Human))
Abbvie
US Patent
LigandPNGBDBM344827(1-[1-(2-fluorophenyl)-1H- | 1-[1-(2-fluorophenyl)-...)
Affinity DataIC50:  403nM. Assay description: Two days prior to the experiment, frozen HEK293 cells stably expressing recombinant human Nav1.7 were quickly thawed and plated at 25,000 cells/well ...
Ligand InfoPC cidPC sid
In DepthDetails US Patent