BDBM345081 6-(1-((4-carboxyphenyl)amino)-1-oxo-3-phenylpropan-2-yl)-3-(3-chloro-2,6-difluorophenyl)-2-methylpyridine 1-oxide::US9783530, 26
SMILES Cc1c(ccc(C(Cc2ccccc2)C(=O)Nc2ccc(cc2)C(O)=O)[n+]1[O-])-c1c(F)ccc(Cl)c1F
InChI Key InChIKey=DENSSICEUFUWPC-UHFFFAOYSA-N
Data  1 IC50
  Tab Delimited (TSV)   2D SDfile   Computed 3D by Vconf -m prep SDfile
Find this compound or compounds like it in BindingDB:
Activity Spreadsheet -- Enzyme Inhibition Constant Data from BindingDB
Found 1 hit for monomerid = 345081
TargetCoagulation factor XI(Homo sapiens (Human))
Merck Sharp & Dohme
US Patent
LigandPNGBDBM345081(6-(1-((4-carboxyphenyl)amino)-1-oxo-3-phenylpropan...)
Affinity DataIC50:  693nM. Assay description: Factor XIa determinations were made in 50 mM HEPES buffer at pH 7.4 containing 150 mM NaCl, 5 mM CaCl2, and 0.1% PEG 8000 (polyethylene glycol; JT Ba...
Ligand InfoPC cidPC sid
In DepthDetails US Patent