BDBM345109 (trans-3-{[3-(1-Benzofuran-2-yl)imidazo[1,2-b]pyridazin-6-yl]amino}cyclobutyl)methanol::US9783543, 1
SMILES OC[C@H]1C[C@@H](C1)Nc1ccc2ncc(-c3cc4ccccc4o3)n2n1
InChI Key InChIKey=ATINSVAPEYBCJL-MQMHXKEQSA-N
Data  2 IC50
  Tab Delimited (TSV)   2D SDfile   Computed 3D by Vconf -m prep SDfile
Find this compound or compounds like it in BindingDB:
Activity Spreadsheet -- Enzyme Inhibition Constant Data from BindingDB
Found 2 hits for monomerid = 345109
TargetMAP kinase-interacting serine/threonine-protein kinase 1(Homo sapiens (Human))
Bayer Pharma Aktiengesellschaft
US Patent
LigandPNGBDBM345109((trans-3-{[3-(1-Benzofuran-2-yl)imidazo[1,2-b]pyri...)
Affinity DataIC50:  11nM. Assay description: For the assay 50 nL of a 100 fold concentrated solution of the test compound in DMSO was pipetted into a black low volume 384 well microtiter plate (...
Ligand InfoPC cidPC sid
In DepthDetails US Patent
TargetMAP kinase-interacting serine/threonine-protein kinase 1(Homo sapiens (Human))
Bayer Pharma Aktiengesellschaft
US Patent
LigandPNGBDBM345109((trans-3-{[3-(1-Benzofuran-2-yl)imidazo[1,2-b]pyri...)
Affinity DataIC50:  8nM. Assay description: For the assay 50 nL of a 100 fold concentrated solution of the test compound in DMSO was pipetted into a black low volume 384 well microtiter plate (...
Ligand InfoPC cidPC sid
In DepthDetails US Patent