BDBM345153 (1S,3R*)-1-(3-Fluoro-2- methylphenyl)-N-hydroxy- 3-(1-methyl-1H-indazol-5- yl)cyclopentanecarboxamide::US9783488, Example 63
SMILES Cc1c(F)cccc1[C@@]1(CC[C@H](C1)c1ccc2n(C)ncc2c1)C(=O)NO
InChI Key InChIKey=JEKQOVILUATGAE-VFNWGFHPSA-N
Data  1 IC50
  Tab Delimited (TSV)   2D SDfile   Computed 3D by Vconf -m prep SDfile
Find this compound or compounds like it in BindingDB:
Activity Spreadsheet -- Enzyme Inhibition Constant Data from BindingDB
Found 1 hit for monomerid = 345153
TargetHistone deacetylase 4(Homo sapiens (Human))
Chdi Foundation
US Patent
LigandPNGBDBM345153((1S,3R*)-1-(3-Fluoro-2- methylphenyl)-N-hydroxy- 3...)
Affinity DataIC50:  110nM. Assay description: The potency of Class IIa Histone Deacetylase (HDAC) inhibitors is quantified by measuring the Histone Deacetylase 4 (HDAC4) catalytic domain enzymati...
Ligand InfoPC cidPC sid
In DepthDetails US Patent