BDBM345182 US9783573, Example 32
SMILES CN[C@@H](C)C(=O)N[C@H](C(=O)N1CC(C[C@H]1C(=O)NC1CCCc2ccccc12)NC(=O)c1ccc(CN(C(C)=O)c2ccc3C[C@H](N(Cc3c2)C(=O)[C@@H](NC(=O)[C@H](C)NC)C(C)(C)C)C(=O)NC2CCCc3ccccc23)cc1)C(C)(C)C
InChI Key InChIKey=SUSFWURNJMTUGZ-LOKLLDKISA-N
Data  2 IC50
  Tab Delimited (TSV)   2D SDfile   Computed 3D by Vconf -m prep SDfile
Find this compound or compounds like it in BindingDB:
Activity Spreadsheet -- Enzyme Inhibition Constant Data from BindingDB
Found 2 hits for monomerid = 345182
TargetBaculoviral IAP repeat-containing protein 2/E3 ubiquitin-protein ligase XIAP(Homo sapiens (Human))
Bristol-Myers Squibb
US Patent
LigandPNGBDBM345182(US9783573, Example 32)
Affinity DataIC50:  110nM. Assay description: Assays were performed in white, flat-bottom, 384-well ProxiPlates (Perkin Elmer). The final assay volume was 10 μL prepared from additions of Hi...
Ligand InfoPC cidPC sid
In DepthDetails US Patent
TargetBaculoviral IAP repeat-containing protein 3/E3 ubiquitin-protein ligase XIAP(Homo sapiens (Human))
Bristol-Myers Squibb
US Patent
LigandPNGBDBM345182(US9783573, Example 32)
Affinity DataIC50:  35nM. Assay description: Assays were performed in black, flat-bottom, 384-well plates. The final assay volume was 50 μL prepared from additions of N-His-Tb-BIR3 (241-356...
Ligand InfoPC cidPC sid
In DepthDetails US Patent