BDBM345313 2-[[1-(4-chlorophenyl)-5-(3-methoxyphenyl)- 1H-pyrazol-3-yl]methoxy]-2- methylpropanoic acid LC-MS (ES, m/z): 401 1H-NMR (400 MHz, MeOD) $#948; 1.54 (6 H, s), 3.71 (3 H, s), 4.62 (2 H, s), 6.67 (1 H, s), 6.75- 6.85 (2 H, m), 6.92 (1 H, ddd), 7.21-7.32 (3 H, m), 7.37-7.46 (2 H, m).::US10202350, Example 59::US10214492, Example 59::US11292767, Example 59::US11724989, Example 59
SMILES COc1cccc(c1)-c1cc(COC(C)(C)C(O)=O)nn1-c1ccc(Cl)cc1
InChI Key InChIKey=ODEHXQRAHIJXOU-UHFFFAOYSA-N
Data  8 IC50
  Tab Delimited (TSV)   2D SDfile   Computed 3D by Vconf -m prep SDfile
Find this compound or compounds like it in BindingDB:
Activity Spreadsheet -- Enzyme Inhibition Constant Data from BindingDB
Found 8 hits for monomerid = 345313
TargetMonocarboxylate transporter 4(Homo sapiens (Human))
Vettore
US Patent
LigandPNGBDBM345313(2-[[1-(4-chlorophenyl)-5-(3-methoxyphenyl)- 1H-py...)
Affinity DataIC50:  340nM. Assay description: MDA-MB-231 breast cancer cells may be used to measure MCT4 activity in cells with high native levels of MCT4 and low levels of MCT1 and are known to ...
Ligand InfoPC cidPC sid
In DepthDetails US Patent
TargetMalignant T-cell-amplified sequence 1(Homo sapiens (human))
Vettore
US Patent
LigandPNGBDBM345313(2-[[1-(4-chlorophenyl)-5-(3-methoxyphenyl)- 1H-py...)
Affinity DataIC50:  8.10E+4nM. Assay description: MCT1 activity may be measured using BT-20 breast cancer cells that express high native levels of MCT1, but do not express MCT4 and are known to those...
Ligand InfoPC cidPC sid
In DepthDetails US Patent
TargetMonocarboxylate transporter 4(Homo sapiens (Human))
Vettore
US Patent
LigandPNGBDBM345313(2-[[1-(4-chlorophenyl)-5-(3-methoxyphenyl)- 1H-py...)
Affinity DataIC50:  340nM. Assay description: MDA-MB-231 breast cancer cells may be used to measure MCT4 activity in cells with high native levels of MCT4 and low levels of MCT1 and are known to ...
Ligand InfoPC cidPC sid
In DepthDetails US Patent
TargetMonocarboxylate transporter 1(Homo sapiens (Human))
Vettore
US Patent
LigandPNGBDBM345313(2-[[1-(4-chlorophenyl)-5-(3-methoxyphenyl)- 1H-py...)
Affinity DataIC50:  8.10E+4nM. Assay description: MCT1 activity may be measured using BT-20 breast cancer cells that express high native levels of MCT1, but do not express MCT4 and are known to those...
Ligand InfoPC cidPC sid
In DepthDetails US Patent
TargetMonocarboxylate transporter 4(Homo sapiens (Human))
Vettore
US Patent
LigandPNGBDBM345313(2-[[1-(4-chlorophenyl)-5-(3-methoxyphenyl)- 1H-py...)
Affinity DataIC50:  340nM. Assay description: MDA-MB-231 breast cancer cells may be used to measure MCT4 activity in cells with high native levels of MCT4 and low levels of MCT1 and are known to ...
Ligand InfoPC cidPC sid
In DepthDetails US Patent
TargetMonocarboxylate transporter 1(Homo sapiens (Human))
Vettore
US Patent
LigandPNGBDBM345313(2-[[1-(4-chlorophenyl)-5-(3-methoxyphenyl)- 1H-py...)
Affinity DataIC50:  8.10E+4nM. Assay description: MCT1 activity may be measured using BT-20 breast cancer cells that express high native levels of MCT1, but do not express MCT4 and are known to those...
Ligand InfoPC cidPC sid
In DepthDetails US Patent
TargetMonocarboxylate transporter 4(Homo sapiens (Human))
Vettore
US Patent
LigandPNGBDBM345313(2-[[1-(4-chlorophenyl)-5-(3-methoxyphenyl)- 1H-py...)
Affinity DataIC50:  340nM. Assay description: MDA-MB-231 breast cancer cells may be used to measure MCT4 activity in cells with high native levels of MCT4 and low levels of MCT1 and are known to ...
Ligand InfoPC cidPC sid
In DepthDetails US Patent
TargetMonocarboxylate transporter 1(Homo sapiens (Human))
Vettore
US Patent
LigandPNGBDBM345313(2-[[1-(4-chlorophenyl)-5-(3-methoxyphenyl)- 1H-py...)
Affinity DataIC50:  8.10E+4nM. Assay description: MCT1 activity may be measured using BT-20 breast cancer cells that express high native levels of MCT1, but do not express MCT4 and are known to those...
Ligand InfoPC cidPC sid
In DepthDetails US Patent