BDBM345415 6-[[2-(4-cyclobutylpiperazin-1-yl)-4,5-dihydroimidazol-1-yl]sulfonyl]-2-methyl-1,3-benzothiazole::US10202354, Example 80
SMILES Cc1nc2ccc(cc2s1)S(=O)(=O)N1CCN=C1N1CCN(CC1)C1CCC1
InChI Key InChIKey=BKTREPWISWFAGF-UHFFFAOYSA-N
Data  1 IC50
  Tab Delimited (TSV)   2D SDfile   Computed 3D by Vconf -m prep SDfile
Find this compound or compounds like it in BindingDB:
Activity Spreadsheet -- Enzyme Inhibition Constant Data from BindingDB
Found 1 hit for monomerid = 345415
TargetLysine-specific demethylase 2B(Homo sapiens (Human))
Genentech
US Patent
LigandPNGBDBM345415(6-[[2-(4-cyclobutylpiperazin-1-yl)-4,5-dihydroimid...)
Affinity DataIC50:  0.112nM. Assay description: Full length KDM2B was cloned, expressed, and purified to homogeneity. Compound inhibition of KDM2B demethylase activity was assessed by monitoring th...
Ligand InfoPC cidPC sid
In DepthDetails US Patent