BDBM345451 1-ethyl-4-[1-(4-methoxyphenyl)sulfonyl-4,5-dihydroimidazol-2-yl]piperazine::US10202354, Example 116
SMILES CCN1CCN(CC1)C1=NCCN1S(=O)(=O)c1ccc(OC)cc1
InChI Key InChIKey=RWPXKXBSRFTCSA-UHFFFAOYSA-N
Data  1 IC50
  Tab Delimited (TSV)   2D SDfile   Computed 3D by Vconf -m prep SDfile
Find this compound or compounds like it in BindingDB:
Activity Spreadsheet -- Enzyme Inhibition Constant Data from BindingDB
Found 1 hit for monomerid = 345451
TargetLysine-specific demethylase 2B(Homo sapiens (Human))
Genentech
US Patent
LigandPNGBDBM345451(1-ethyl-4-[1-(4-methoxyphenyl)sulfonyl-4,5-dihydro...)
Affinity DataIC50:  5.45nM. Assay description: Full length KDM2B was cloned, expressed, and purified to homogeneity. Compound inhibition of KDM2B demethylase activity was assessed by monitoring th...
Ligand InfoPC cidPC sid
In DepthDetails US Patent