BDBM34557 MLS000111518::SMR000107440::cid_1185647
SMILES Cc1ccccc1N1C(=O)c2sc3nc4CCCc4c(=O)n3c2C1=O
InChI Key InChIKey=GYSBZJAKQUEIOW-UHFFFAOYSA-N
Data  2 IC50
  Tab Delimited (TSV)   2D SDfile   Computed 3D by Vconf -m prep SDfile
Find this compound or compounds like it in BindingDB:
Activity Spreadsheet -- Enzyme Inhibition Constant Data from BindingDB
Found 2 hits for monomerid = 34557
TargetNeutrophil cytosol factor 1 [S99G](Human)
Emory University
Curated by PubChem BioAssay
LigandPNGBDBM34557(MLS000111518 | SMR000107440 | cid_1185647)
Affinity DataIC50:  5.00E+4nM. Assay description: NIH Molecular Libraries Screening Centers Network [MLSCN] Emory Chemical Biology Discovery Center in MLSCN Assay provider: Susan Smith, Emory Univers...
In DepthDetails PCBioAssay
TargetNuclear receptor subfamily 4 group A member 1(Human)
Burnham Center For Chemical Genomics
Curated by PubChem BioAssay
LigandPNGBDBM34557(MLS000111518 | SMR000107440 | cid_1185647)
Affinity DataIC50:  5.49E+4nM. Assay description: Sanford-Burnham Center for Chemical Genomics (SBCCG) Sanford-Burnham Medical Research Institute (San Diego, CA) NIH Molecular Libraries Screening Cen...
In DepthDetails PCBioAssay