BDBM345575 Propane-1-sulfonic acid [2-(2- fluoro-6-methyl-phenoxy)-6-(1- methyl-6-oxo-1,6-dihydro-pyridin- 3-yl)-pyrimidin-4-yl]-amide::US10202360, Example 120
SMILES CCCS(=O)(=O)Nc1cc(nc(Oc2c(C)cccc2F)n1)-c1ccc(=O)n(C)c1
InChI Key InChIKey=GECSBTNVMZWAAG-UHFFFAOYSA-N
Data  1 IC50
  Tab Delimited (TSV)   2D SDfile   Computed 3D by Vconf -m prep SDfile
Find this compound or compounds like it in BindingDB:
Activity Spreadsheet -- Enzyme Inhibition Constant Data from BindingDB
Found 1 hit for monomerid = 345575
TargetCREB-binding protein(Homo sapiens (Human))
Celgene Quanticel Research
US Patent
LigandPNGBDBM345575(Propane-1-sulfonic acid [2-(2- fluoro-6-methyl-phe...)
Affinity DataIC50: <500nM. Assay description: Determination of the IC50 for the CREBBP inhibitors disclosed herein was performed as follows: CREBBP was cloned and expressed in E. Coli as His-tag ...
Ligand InfoPC cidPC sid
In DepthDetails US Patent