BDBM345757 5-{2-(2-Fluoro-6-methyl-phenoxy)- 6-[(pyridin-2-ylmethyl)-amino]- pyrimidin-4-yl}-1-methyl-1H- pyridin-2-one::US10202360, Example 302
SMILES Cc1cccc(F)c1Oc1nc(NCc2ccccn2)cc(n1)-c1ccc(=O)n(C)c1
InChI Key InChIKey=UINXASLZCOUWJM-UHFFFAOYSA-N
Data  1 IC50
  Tab Delimited (TSV)   2D SDfile   Computed 3D by Vconf -m prep SDfile
Find this compound or compounds like it in BindingDB:
Activity Spreadsheet -- Enzyme Inhibition Constant Data from BindingDB
Found 1 hit for monomerid = 345757
TargetCREB-binding protein(Homo sapiens (Human))
Celgene Quanticel Research
US Patent
LigandPNGBDBM345757(5-{2-(2-Fluoro-6-methyl-phenoxy)- 6-[(pyridin-2-yl...)
Affinity DataIC50: <500nM. Assay description: Determination of the IC50 for the CREBBP inhibitors disclosed herein was performed as follows: CREBBP was cloned and expressed in E. Coli as His-tag ...
Ligand InfoPC cidPC sid
In DepthDetails US Patent