BDBM345824 US10202365, Compound 1::US10774070, Compound 1
SMILES Cc1cc(Nc2cc(C)nc(n2)-c2ccc(nc2)C(=O)NCc2ccoc2)n[nH]1
InChI Key InChIKey=PSISXGUMDXHPQP-UHFFFAOYSA-N
Data  4 IC50
  Tab Delimited (TSV)   2D SDfile   Computed 3D by Vconf -m prep SDfile
Find this compound or compounds like it in BindingDB:
Activity Spreadsheet -- Enzyme Inhibition Constant Data from BindingDB
Found 4 hits for monomerid = 345824
TargetProto-oncogene tyrosine-protein kinase receptor Ret(Homo sapiens (Human))
Blueprint Medicines
US Patent
LigandPNGBDBM345824(US10202365, Compound 1 | US10774070, Compound 1)
Affinity DataIC50:  55nM. Assay description: In each well of a 384-well plate, 7.5 nM-10 nM of wild type RET (ProQinase 1090-0000-1) is incubated in a total of 12.5 μL of buffer (100 mM HEP...
Ligand InfoPC cidPC sid
In DepthDetails US Patent
TargetProto-oncogene tyrosine-protein kinase receptor Ret [V804L](Homo sapiens (Human))
Blueprint Medicines
US Patent
LigandPNGBDBM345824(US10202365, Compound 1 | US10774070, Compound 1)
Affinity DataIC50:  55nM. Assay description: In each well of a 384-well plate, 7.5 nM-10 nM of mutant RET (ProQinase 1096-0000-1) is incubated in a total of 12.5 μL of buffer (100 mM HEPES ...
Ligand InfoPC cidPC sid
In DepthDetails US Patent
TargetProto-oncogene tyrosine-protein kinase receptor Ret(Homo sapiens (Human))
Blueprint Medicines
US Patent
LigandPNGBDBM345824(US10202365, Compound 1 | US10774070, Compound 1)
Affinity DataIC50:  55nM. Assay description: In each well of a 384-well plate, 7.5 nM-10 nM of wild type RET (ProQinase 1090-0000-1) is incubated in a total of 12.5 μL of buffer (100 mM HEP...
Ligand InfoPC cidPC sid
In DepthDetails US Patent
TargetProto-oncogene tyrosine-protein kinase receptor Ret [V804L](Homo sapiens (Human))
Blueprint Medicines
US Patent
LigandPNGBDBM345824(US10202365, Compound 1 | US10774070, Compound 1)
Affinity DataIC50:  55nM. Assay description: In each well of a 384-well plate, 7.5 nM-10 nM of mutant RET (ProQinase 1096-0000-1) is incubated in a total of 12.5 μL of buffer (100 mM HEPES ...
Ligand InfoPC cidPC sid
In DepthDetails US Patent