BDBM345870 US10202367, Compound 16
SMILES CC1OC(=NC1CN1CCC(CC1)C(=O)NCCCN1C[C@@H](C)C[C@@H](C)C1)c1ccc(Cl)cc1
InChI Key InChIKey=VFDVABAWSWOZAQ-BRQRVVEPSA-N
Data  1 EC50
  Tab Delimited (TSV)   2D SDfile   Computed 3D by Vconf -m prep SDfile
Find this compound or compounds like it in BindingDB:
Activity Spreadsheet -- Enzyme Inhibition Constant Data from BindingDB
Found 1 hit for monomerid = 345870
TargetGenome polyprotein(Hepatitis C virus genotype 2a (isolate HC-J6) (HCV...)
The United States Of America, As Represented By The Secretary, Department Of Health And Human Services
US Patent
LigandPNGBDBM345870(US10202367, Compound 16)
Affinity DataEC50:  110nM. Assay description: This example demonstrates the EC50 and CC50 values against HCV according to the HCVcc-RLuc reporter assay described in Example 5 and the cytotoxicity...
Ligand InfoPC cidPC sid
In DepthDetails US Patent