BDBM345930 N-(2-Dimethylamino-ethyl)-2-(4-ethyl-2,3,4,5-tetrahydro-benzo[f][1,4]oxazepin-9-ylamino)-N-(2-trifluoromethyl-benzyl)-acetamide::US10202368, Example 5
SMILES CCN1CCOc2c(C1)cccc2NCC(=O)N(CCN(C)C)Cc1ccccc1C(F)(F)F
InChI Key InChIKey=HRZPETMHUTVMNG-UHFFFAOYSA-N
Data  1 EC50
  Tab Delimited (TSV)   2D SDfile   Computed 3D by Vconf -m prep SDfile
Find this compound or compounds like it in BindingDB:
Activity Spreadsheet -- Enzyme Inhibition Constant Data from BindingDB
Found 1 hit for monomerid = 345930
TargetAtypical chemokine receptor 3(Homo sapiens (Human))
Idorsia Pharmaceuticals
US Patent
LigandPNGBDBM345930(N-(2-Dimethylamino-ethyl)-2-(4-ethyl-2,3,4,5-tetra...)
Affinity DataEC50:  7nM. Assay description: The assay is using the PathHunter CHO-K1 CXCR7 β-arrestin cell line from DiscoverX. The system is based on the Enzyme Fragment Complementation T...
Ligand InfoPC cidPC sid
In DepthDetails US Patent