BDBM345956 2-(4-Cyclopropylmethyl-5-oxo-2,3,4,5-tetrahydro-benzo[f][1,4]oxazepin-6-ylamino)-N-(2,6-dichloro-benzyl)-N-(2-dimethylamino-ethyl)-acetamide::US10202368, Example 31
SMILES CN(C)CCN(Cc1c(Cl)cccc1Cl)C(=O)CNc1cccc2OCCN(CC3CC3)C(=O)c12
InChI Key InChIKey=LAPQJPAURYVHON-UHFFFAOYSA-N
Data  1 EC50
  Tab Delimited (TSV)   2D SDfile   Computed 3D by Vconf -m prep SDfile
Find this compound or compounds like it in BindingDB:
Activity Spreadsheet -- Enzyme Inhibition Constant Data from BindingDB
Found 1 hit for monomerid = 345956
TargetAtypical chemokine receptor 3(Homo sapiens (Human))
Idorsia Pharmaceuticals
US Patent
LigandPNGBDBM345956(2-(4-Cyclopropylmethyl-5-oxo-2,3,4,5-tetrahydro-be...)
Affinity DataEC50:  27nM. Assay description: The assay is using the PathHunter CHO-K1 CXCR7 β-arrestin cell line from DiscoverX. The system is based on the Enzyme Fragment Complementation T...
Ligand InfoPC cidPC sid
In DepthDetails US Patent