BDBM345991 2-(4-Cyclopropylmethyl-3-oxo-2,3,4,5-tetrahydro-benzo[f][1,4]oxazepin-9-ylamino)-N-(2-isopropylamino-ethyl)-N-(2-trifluoromethyl-benzyl)-acetamide::US10202368, Example 68
SMILES CC(C)NCCN(Cc1ccccc1C(F)(F)F)C(=O)CNc1cccc2CN(CC3CC3)C(=O)COc12
InChI Key InChIKey=KJQWNMUIFWPWFV-UHFFFAOYSA-N
Data  1 EC50
  Tab Delimited (TSV)   2D SDfile   Computed 3D by Vconf -m prep SDfile
Find this compound or compounds like it in BindingDB:
Activity Spreadsheet -- Enzyme Inhibition Constant Data from BindingDB
Found 1 hit for monomerid = 345991
TargetAtypical chemokine receptor 3(Homo sapiens (Human))
Idorsia Pharmaceuticals
US Patent
LigandPNGBDBM345991(2-(4-Cyclopropylmethyl-3-oxo-2,3,4,5-tetrahydro-be...)
Affinity DataEC50:  15nM. Assay description: The assay is using the PathHunter CHO-K1 CXCR7 β-arrestin cell line from DiscoverX. The system is based on the Enzyme Fragment Complementation T...
Ligand InfoPC cidPC sid
In DepthDetails US Patent