BDBM346047 4-[2-(6-Methyl-2-m- tolyl-3H- benzoimidazol-5- ylamino)-thiazol-4- yl]-benzonitrile::US10202370, Example 074
SMILES Cc1cccc(c1)-c1nc2cc(C)c(Nc3nc(cs3)-c3ccc(cc3)C#N)cc2[nH]1
InChI Key InChIKey=QXLAELHFYHJNOE-UHFFFAOYSA-N
Data  1 EC50
  Tab Delimited (TSV)   2D SDfile   Computed 3D by Vconf -m prep SDfile
Find this compound or compounds like it in BindingDB:
Activity Spreadsheet -- Enzyme Inhibition Constant Data from BindingDB
Found 1 hit for monomerid = 346047
TargetMast/stem cell growth factor receptor Kit(Homo sapiens (Human))
Ab Science
US Patent
LigandPNGBDBM346047(4-[2-(6-Methyl-2-m- tolyl-3H- benzoimidazol-5- yla...)
Affinity DataEC50: <1.00E+3nM. Assay description: Colorimetric cell proliferation and viability assay (reagent CellTiter-Blue purchased from Promega cat N°G8081) was performed on BaF3 Kit WT cell lin...
Ligand InfoPC cidPC sid
In DepthDetails US Patent