BDBM346077 US10202370, Example 119::[4-(2-Chloro-pyridin- 4-yl)-thiazol-2-yl]-[2- (3-difluoromethyl- phenyl)-1,6- dimethyl-1H- benzoimidazol-5-yl]- amine
SMILES Cc1cc2n(C)c(nc2cc1Nc1nc(cs1)-c1ccnc(Cl)c1)-c1cccc(c1)C(F)F
InChI Key InChIKey=YQZSAMDSAMHWFV-UHFFFAOYSA-N
Data  1 EC50
  Tab Delimited (TSV)   2D SDfile   Computed 3D by Vconf -m prep SDfile
Find this compound or compounds like it in BindingDB:
Activity Spreadsheet -- Enzyme Inhibition Constant Data from BindingDB
Found 1 hit for monomerid = 346077
TargetMast/stem cell growth factor receptor Kit(Homo sapiens (Human))
Ab Science
US Patent
LigandPNGBDBM346077(US10202370, Example 119 | [4-(2-Chloro-pyridin- 4-...)
Affinity DataEC50: <1.00E+3nM. Assay description: Colorimetric cell proliferation and viability assay (reagent CellTiter-Blue purchased from Promega cat N°G8081) was performed on BaF3 Kit WT cell lin...
Ligand InfoPC cidPC sid
In DepthDetails US Patent