BDBM346117 (6-Methyl-2-pyridin- 3-yl-3H- benzoimidazol-5-yl)- (4-pyridin-3-yl- pyrimidin-2-yl)- amine::US10202370, Example 014
SMILES Cc1cc2nc([nH]c2cc1Nc1nccc(n1)-c1cccnc1)-c1cccnc1
InChI Key InChIKey=SIEUCEWKJONWJQ-UHFFFAOYSA-N
Data  1 EC50
  Tab Delimited (TSV)   2D SDfile   Computed 3D by Vconf -m prep SDfile
Find this compound or compounds like it in BindingDB:
Activity Spreadsheet -- Enzyme Inhibition Constant Data from BindingDB
Found 1 hit for monomerid = 346117
TargetMast/stem cell growth factor receptor Kit(Homo sapiens (Human))
Ab Science
US Patent
LigandPNGBDBM346117((6-Methyl-2-pyridin- 3-yl-3H- benzoimidazol-5-yl)-...)
Affinity DataEC50:  5.50E+3nM. Assay description: Colorimetric cell proliferation and viability assay (reagent CellTiter-Blue purchased from Promega cat N°G8081) was performed on BaF3 Kit WT cell lin...
Ligand InfoPC cidPC sid
In DepthDetails US Patent