BDBM346124 (2-Benzyl-6-methyl- 3H-benzoimidazol-5- yl)-(4-pyridin-3-yl- thiazol-2-yl)-amine::US10202370, Example 022
SMILES Cc1cc2nc(Cc3ccccc3)[nH]c2cc1Nc1nc(cs1)-c1cccnc1
InChI Key InChIKey=LIVUGAOKPFFCIN-UHFFFAOYSA-N
Data  1 EC50
  Tab Delimited (TSV)   2D SDfile   Computed 3D by Vconf -m prep SDfile
Find this compound or compounds like it in BindingDB:
Activity Spreadsheet -- Enzyme Inhibition Constant Data from BindingDB
Found 1 hit for monomerid = 346124
TargetMast/stem cell growth factor receptor Kit(Homo sapiens (Human))
Ab Science
US Patent
LigandPNGBDBM346124((2-Benzyl-6-methyl- 3H-benzoimidazol-5- yl)-(4-pyr...)
Affinity DataEC50:  5.50E+3nM. Assay description: Colorimetric cell proliferation and viability assay (reagent CellTiter-Blue purchased from Promega cat N°G8081) was performed on BaF3 Kit WT cell lin...
Ligand InfoPC cidPC sid
In DepthDetails US Patent