BDBM346149 US10202370, Example 067::[6-Methyl-2-(4- trifluoromethyl- phenyl)-1H- benzoimidazol-5-yl]- (4-pyrimidin-5-yl- thiazol-2-yl)-amine
SMILES Cc1cc2nc([nH]c2cc1Nc1nc(cs1)-c1cncnc1)-c1ccc(cc1)C(F)(F)F
InChI Key InChIKey=WCUGEZLLKDFISU-UHFFFAOYSA-N
Data  1 EC50
  Tab Delimited (TSV)   2D SDfile   Computed 3D by Vconf -m prep SDfile
Find this compound or compounds like it in BindingDB:
Activity Spreadsheet -- Enzyme Inhibition Constant Data from BindingDB
Found 1 hit for monomerid = 346149
TargetMast/stem cell growth factor receptor Kit(Homo sapiens (Human))
Ab Science
US Patent
LigandPNGBDBM346149(US10202370, Example 067 | [6-Methyl-2-(4- trifluor...)
Affinity DataEC50:  5.50E+3nM. Assay description: Colorimetric cell proliferation and viability assay (reagent CellTiter-Blue purchased from Promega cat N°G8081) was performed on BaF3 Kit WT cell lin...
Ligand InfoPC cidPC sid
In DepthDetails US Patent