BDBM346156 US10202370, Example 090::[2-(3-Difluoromethyl- phenyl)-1-methyl- 1H-benzoimidazol-5- yl]-(4-pyridin-3-yl- thiazol-2-yl)-amine
SMILES Cn1c(nc2cc(Nc3nc(cs3)-c3cccnc3)ccc12)-c1cccc(c1)C(F)F
InChI Key InChIKey=VGIGQPWHRBBAEB-UHFFFAOYSA-N
Data  1 EC50
  Tab Delimited (TSV)   2D SDfile   Computed 3D by Vconf -m prep SDfile
Find this compound or compounds like it in BindingDB:
Activity Spreadsheet -- Enzyme Inhibition Constant Data from BindingDB
Found 1 hit for monomerid = 346156
TargetMast/stem cell growth factor receptor Kit(Homo sapiens (Human))
Ab Science
US Patent
LigandPNGBDBM346156(US10202370, Example 090 | [2-(3-Difluoromethyl- ph...)
Affinity DataEC50:  5.50E+3nM. Assay description: Colorimetric cell proliferation and viability assay (reagent CellTiter-Blue purchased from Promega cat N°G8081) was performed on BaF3 Kit WT cell lin...
Ligand InfoPC cidPC sid
In DepthDetails US Patent