BDBM346169 Ethanesulfonic acid {3-[1,6-dimethyl-5- (4-pyridin-4-yl- thiazol-2-ylamino)- 1H-benzoimidazol-2- yl]-phenyl}-amide::US10202370, Example 134
SMILES CCS(=O)(=O)Nc1cccc(c1)-c1nc2cc(Nc3nc(cs3)-c3ccncc3)c(C)cc2n1C
InChI Key InChIKey=CQKJHUPGCLITRS-UHFFFAOYSA-N
Data  1 EC50
  Tab Delimited (TSV)   2D SDfile   Computed 3D by Vconf -m prep SDfile
Find this compound or compounds like it in BindingDB:
Activity Spreadsheet -- Enzyme Inhibition Constant Data from BindingDB
Found 1 hit for monomerid = 346169
TargetMast/stem cell growth factor receptor Kit(Homo sapiens (Human))
Ab Science
US Patent
LigandPNGBDBM346169(Ethanesulfonic acid {3-[1,6-dimethyl-5- (4-pyridin...)
Affinity DataEC50:  5.50E+3nM. Assay description: Colorimetric cell proliferation and viability assay (reagent CellTiter-Blue purchased from Promega cat N°G8081) was performed on BaF3 Kit WT cell lin...
Ligand InfoPC cidPC sid
In DepthDetails US Patent