BDBM346174 US10202371, Example 4
SMILES CC[C@H]1[C@H](OC(=O)N1c1cc(nc(n1)N1CCOCC1)-c1cnc(N)nc1C(F)(F)F)c1ccccc1
InChI Key InChIKey=QPCPSPSSGSDMCQ-PKOBYXMFSA-N
Data  8 IC50
  Tab Delimited (TSV)   2D SDfile   Computed 3D by Vconf -m prep SDfile
Find this compound or compounds like it in BindingDB:
Activity Spreadsheet -- Enzyme Inhibition Constant Data from BindingDB
Found 8 hits for monomerid = 346174
LigandPNGBDBM346174(US10202371, Example 4)
Affinity DataIC50:  47nM. Assay description: The luminescence-based ATP detection reagent KinaseGlo was obtained from Promega, (Cat. No. V6714, Lot No. 236161) through Catalys, Wallisellen, Swit...
Ligand InfoPC cidPC sid
In DepthDetails US Patent
LigandPNGBDBM346174(US10202371, Example 4)
Affinity DataIC50:  159nM. Assay description: The luminescence-based ATP detection reagent KinaseGlo was obtained from Promega, (Cat. No. V6714, Lot No. 236161) through Catalys, Wallisellen, Swit...
Ligand InfoPC cidPC sid
In DepthDetails US Patent
LigandPNGBDBM346174(US10202371, Example 4)
Affinity DataIC50:  66nM
Ligand InfoPC cidPC sid
In DepthDetails US Patent
LigandPNGBDBM346174(US10202371, Example 4)
Affinity DataIC50:  298nM. Assay description: AlphaScreen (Amplified Luminescent Proximity Homogeneous Assay, ALPHA, Perkin Elmer) is a non-radioactive bead-based proximity assay technology to st...
Ligand InfoPC cidPC sid
In DepthDetails US Patent
TargetSerine/threonine-protein kinase mTOR(Homo sapiens (Human))
Novartis
US Patent
LigandPNGBDBM346174(US10202371, Example 4)
Affinity DataIC50: >9.70E+3nM. Assay description: TR-FRET assays for protein kinases uses a long-lifetime lanthanide Terbium or Europium chelates as the donor species which overcome interference by c...
Ligand InfoPC cidPC sid
In DepthDetails US Patent
LigandPNGBDBM346174(US10202371, Example 4)
Affinity DataIC50:  597nM. Assay description: AlphaScreen (Amplified Luminescent Proximity Homogeneous Assay, ALPHA, Perkin Elmer) is a non-radioactive bead-based proximity assay technology to st...
Ligand InfoPC cidPC sid
In DepthDetails US Patent
LigandPNGBDBM346174(US10202371, Example 4)
Affinity DataIC50:  757nM. Assay description: AlphaScreen (Amplified Luminescent Proximity Homogeneous Assay, ALPHA, Perkin Elmer) is a non-radioactive bead-based proximity assay technology to st...
Ligand InfoPC cidPC sid
In DepthDetails US Patent
LigandPNGBDBM346174(US10202371, Example 4)
Affinity DataIC50:  4.50E+3nM
Ligand InfoPC cidPC sid
In DepthDetails US Patent