BDBM346193 US10202373, Compound I-5::US10202373, Example 3T
SMILES CC(=O)Nc1cc(ccn1)-c1cnc(C)c2n(cc(C)c12)S(C)(=O)=O
InChI Key InChIKey=OTSFYRCRAZYOTC-UHFFFAOYSA-N
Data  1 IC50
  Tab Delimited (TSV)   2D SDfile   Computed 3D by Vconf -m prep SDfile
Find this compound or compounds like it in BindingDB:
Activity Spreadsheet -- Enzyme Inhibition Constant Data from BindingDB
Found 1 hit for monomerid = 346193
TargetPhosphatidylinositol 3-kinase catalytic subunit type 3(Homo sapiens (Human))
Millennium Pharmaceuticals
US Patent
LigandPNGBDBM346193(US10202373, Compound I-5 | US10202373, Example 3T)
Affinity DataIC50:  75nM. Assay description: 100 nL compounds in DMSO are added to wells of a 384 well microtitre plate (Greiner 780076). At room temperature: 5 ul VPS34 reaction buffer (Invitro...
Ligand InfoPC cidPC sid
In DepthDetails US Patent