BDBM346215 US10202373, Compound I-29::US10202373, Example 4A
SMILES COC(=O)Nc1cc(ccn1)-c1cncc2n(ccc12)S(C)(=O)=O
InChI Key InChIKey=IMODIMPXDVBSKY-UHFFFAOYSA-N
Data  1 IC50
  Tab Delimited (TSV)   2D SDfile   Computed 3D by Vconf -m prep SDfile
Find this compound or compounds like it in BindingDB:
Activity Spreadsheet -- Enzyme Inhibition Constant Data from BindingDB
Found 1 hit for monomerid = 346215
TargetPhosphatidylinositol 3-kinase catalytic subunit type 3(Homo sapiens (Human))
Millennium Pharmaceuticals
US Patent
LigandPNGBDBM346215(US10202373, Compound I-29 | US10202373, Example 4A)
Affinity DataIC50:  30nM. Assay description: 100 nL compounds in DMSO are added to wells of a 384 well microtitre plate (Greiner 780076). At room temperature: 5 ul VPS34 reaction buffer (Invitro...
Ligand InfoPC cidPC sid
In DepthDetails US Patent