BDBM346216 US10202373, Compound I-30::US10202373, Example 4H
SMILES COC(=O)Nc1cc(ccn1)-c1cncc2n(ccc12)S(=O)(=O)C1CC1
InChI Key InChIKey=XMHAVEXGTPFWSO-UHFFFAOYSA-N
Data  1 IC50
  Tab Delimited (TSV)   2D SDfile   Computed 3D by Vconf -m prep SDfile
Find this compound or compounds like it in BindingDB:
Activity Spreadsheet -- Enzyme Inhibition Constant Data from BindingDB
Found 1 hit for monomerid = 346216
TargetPhosphatidylinositol 3-kinase catalytic subunit type 3(Homo sapiens (Human))
Millennium Pharmaceuticals
US Patent
LigandPNGBDBM346216(US10202373, Compound I-30 | US10202373, Example 4H)
Affinity DataIC50:  30nM. Assay description: 100 nL compounds in DMSO are added to wells of a 384 well microtitre plate (Greiner 780076). At room temperature: 5 ul VPS34 reaction buffer (Invitro...
Ligand InfoPC cidPC sid
In DepthDetails US Patent