BDBM346265 2-[4-(4-methylpiperazin-1-yl)pyrrolo[2,3-b]pyridin-1-yl]-N-(5-pyrazin-2-yl-2-pyridyl)acetamide::US10202375, Example 28
SMILES CN1CCN(CC1)c1ccnc2n(CC(=O)Nc3ccc(cn3)-c3cnccn3)ccc12
InChI Key InChIKey=CEUSXLCIIKIEGE-UHFFFAOYSA-N
Data  1 IC50
  Tab Delimited (TSV)   2D SDfile   Computed 3D by Vconf -m prep SDfile
Find this compound or compounds like it in BindingDB:
Activity Spreadsheet -- Enzyme Inhibition Constant Data from BindingDB
Found 1 hit for monomerid = 346265
TargetProtein Wnt-3a(Mus musculus)
Redx Pharma
US Patent
LigandPNGBDBM346265(2-[4-(4-methylpiperazin-1-yl)pyrrolo[2,3-b]pyridin...)
Affinity DataIC50: >5nM. Assay description: Mouse L cells transfected to constitutively produce biologically active murine Wnt-3a, referred to as L-Wnt cells, were purchased from the American T...
Ligand InfoPC cidPC sid
In DepthDetails US Patent