BDBM346430 US10202378, Example 43::ethyl 2,6-dimethyl-7-oxo-4-[4,4,4-trifluoro-3-hydroxy-3-[3-(hydroxymethyl)phenyl]but-1-ynyl]-1H-pyrrolo[2,3-c]pyridine-3-carboxylate
SMILES CCOC(=O)c1c(C)[nH]c2c1c(cn(C)c2=O)C#CC(O)(c1cccc(CO)c1)C(F)(F)F
InChI Key
Data  2 IC50
  Tab Delimited (TSV)   2D SDfile   Computed 3D by Vconf -m prep SDfile
Find this compound or compounds like it in BindingDB:
Activity Spreadsheet -- Enzyme Inhibition Constant Data from BindingDB
Found 2 hits for monomerid = 346430
TargetTranscription initiation factor TFIID subunit 1 [1381-1497](Homo sapiens (human))
Genentech
US Patent
LigandPNGBDBM346430(US10202378, Example 43 | ethyl 2,6-dimethyl-7-oxo-...)
Affinity DataIC50:  257nM. Assay description: His/Flag epitope tagged TAF1-BD11381-1497 was cloned, expressed, and purified to homogeneity. TAF1-BD binding and inhibition was assessed by monitori...
Ligand InfoPC cidPC sid
In DepthDetails US Patent
TargetTranscription initiation factor TFIID subunit 1 [1504-1635](Homo sapiens (Human))
Genentech
US Patent
LigandPNGBDBM346430(US10202378, Example 43 | ethyl 2,6-dimethyl-7-oxo-...)
Affinity DataIC50:  35.5nM. Assay description: His/Flag epitope tagged TAF1-BD21504-1635 was cloned, expressed, and purified to homogeneity. TAF1-BD2 binding and inhibition was assessed by monitor...
Ligand InfoPC cidPC sid
In DepthDetails US Patent