BDBM34669 1-(4-isoamoxyphenyl)-2-(4-methylmorpholin-4-ium-4-yl)ethanone;iodide::1-[4-(3-methylbutoxy)phenyl]-2-(4-methyl-4-morpholin-4-iumyl)ethanone;iodide::1-[4-(3-methylbutoxy)phenyl]-2-(4-methylmorpholin-4-ium-4-yl)ethanone;iodide::4-Methyl-4-{2-[4-(3-methyl-butoxy)-phenyl]-2-oxo-ethyl}-morpholin-4-ium::MLS000526970::SMR000117444::cid_9549540
SMILES CC(C)CCOc1ccc(cc1)C(=O)C[N+]1(C)CCOCC1
InChI Key InChIKey=GHRNNMQIPCVYQZ-UHFFFAOYSA-N
Data  2 IC50
  Tab Delimited (TSV)   2D SDfile   Computed 3D by Vconf -m prep SDfile
Find this compound or compounds like it in BindingDB:
Activity Spreadsheet -- Enzyme Inhibition Constant Data from BindingDB
Found 2 hits for monomerid = 34669
TargetCarboxy-terminal domain RNA polymerase II polypeptide A small phosphatase 1(Homo sapiens (Human))
Burnham Center For Chemical Genomics
Curated by PubChem BioAssay
LigandPNGBDBM34669(1-(4-isoamoxyphenyl)-2-(4-methylmorpholin-4-ium-4-...)
Affinity DataIC50:  9.75E+3nM. Assay description: Data Source: Sanford-Burnham Center for Chemical Genomics (SBCCG) Source Affiliation: Sanford-Burnham Medical Research Institute (SBMRI, San Diego, C...
In DepthDetails PCBioAssay
TargetMannose-6-phosphate isomerase(Homo sapiens (Human))
Burnham Center For Chemical Genomics
Curated by PubChem BioAssay
LigandPNGBDBM34669(1-(4-isoamoxyphenyl)-2-(4-methylmorpholin-4-ium-4-...)
Affinity DataIC50: >5.00E+4nMpH: 7.4 T: 2°C. Assay description: The purpose of this assay is to identify non-competititve inhibitors of human PMI. This is accomplished by using a G6PD- NADPH-coupled assay. In the ...
In DepthDetails PCBioAssay