BDBM34692 2-Methyl-3-(4-methyl-benzoyl)-naphtho[1,2-b]furan-4,5-dione::2-methyl-3-(4-methylbenzoyl)benzo[g][1]benzofuran-4,5-dione::2-methyl-3-(4-methylphenyl)carbonyl-benzo[g][1]benzofuran-4,5-dione::2-methyl-3-[(4-methylphenyl)-oxomethyl]benzo[g]benzofuran-4,5-dione::2-methyl-3-p-toluoyl-benzo[g]benzofuran-4,5-quinone::MLS000554106::SMR000146423::cid_3696529
SMILES Cc1oc-2c(c1C(=O)c1ccc(C)cc1)C(=O)C(=O)c1ccccc-21
InChI Key InChIKey=LYTUULBNMPEELR-UHFFFAOYSA-N
Data  15 IC50  1 EC50
  Tab Delimited (TSV)   2D SDfile   Computed 3D by Vconf -m prep SDfile
Find this compound or compounds like it in BindingDB:
Activity Spreadsheet -- Enzyme Inhibition Constant Data from BindingDB
Found 16 hits for monomerid = 34692
TargetMannose-6-phosphate isomerase(Homo sapiens (Human))
Burnham Center For Chemical Genomics
Curated by PubChem BioAssay
LigandPNGBDBM34692(2-Methyl-3-(4-methyl-benzoyl)-naphtho[1,2-b]furan-...)
Affinity DataIC50: >5.00E+4nMpH: 7.4 T: 2°C. Assay description: The purpose of this assay is to identify non-competititve inhibitors of human PMI. This is accomplished by using a G6PD- NADPH-coupled assay. In the ...
In DepthDetails PCBioAssay
TargetProtein artemis(Homo sapiens (Human))
Burnham Center For Chemical Genomics
Curated by PubChem BioAssay
LigandPNGBDBM34692(2-Methyl-3-(4-methyl-benzoyl)-naphtho[1,2-b]furan-...)
Affinity DataIC50:  2.20E+3nM. Assay description: Data Source: Sanford-Burnham Center for Chemical Genomics (SBCCG) Source Affiliation: Sanford-Burnham Medical Research Institute (SBMRI, San Diego CA...
In DepthDetails PCBioAssay
TargetSentrin-specific protease 8(Homo sapiens (Human))
Burnham Center For Chemical Genomics
Curated by PubChem BioAssay
LigandPNGBDBM34692(2-Methyl-3-(4-methyl-benzoyl)-naphtho[1,2-b]furan-...)
Affinity DataIC50:  7.82E+3nM. Assay description: Data Source: Sanford-Burnham Center for Chemical Genomics (SBCCG) Source Affiliation: Sanford-Burnham Medical Research Institute (SBMRI, San Diego, C...
In DepthDetails PCBioAssay
TargetSentrin-specific protease 6(Homo sapiens (Human))
Burnham Center For Chemical Genomics
Curated by PubChem BioAssay
LigandPNGBDBM34692(2-Methyl-3-(4-methyl-benzoyl)-naphtho[1,2-b]furan-...)
Affinity DataIC50:  4.76E+3nM. Assay description: Data Source: Sanford-Burnham Center for Chemical Genomics (SBCCG) Source Affiliation: Sanford-Burnham Medical Research Institute (SBMRI, San Diego, C...
In DepthDetails PCBioAssay
TargetCaspase-3(Homo sapiens (Human))
Burnham Center For Chemical Genomics
Curated by PubChem BioAssay
LigandPNGBDBM34692(2-Methyl-3-(4-methyl-benzoyl)-naphtho[1,2-b]furan-...)
Affinity DataIC50:  2.91E+4nM. Assay description: Data Source: Sanford-Burnham Center for Chemical Genomics (SBCCG) Source Affiliation: Sanford-Burnham Medical Research Institute (SBMRI, San Diego, C...
In DepthDetails PCBioAssay
TargetHexokinase HKDC1 [W721R](Homo sapiens (Human))
Burnham Center For Chemical Genomics
Curated by PubChem BioAssay
LigandPNGBDBM34692(2-Methyl-3-(4-methyl-benzoyl)-naphtho[1,2-b]furan-...)
Affinity DataIC50:  6.94E+3nM. Assay description: Data Source: Sanford-Burnham Center for Chemical Genomics (SBCCG) Source Affiliation: Sanford-Burnham Medical Research Institute (SBMRI, San Diego, C...
In DepthDetails PCBioAssay
TargetHexokinase HKDC1 [W721R](Homo sapiens (Human))
Burnham Center For Chemical Genomics
Curated by PubChem BioAssay
LigandPNGBDBM34692(2-Methyl-3-(4-methyl-benzoyl)-naphtho[1,2-b]furan-...)
Affinity DataIC50:  2.15E+4nM. Assay description: Data Source: Sanford-Burnham Center for Chemical Genomics (SBCCG) Source Affiliation: Sanford-Burnham Medical Research Institute (SBMRI, San Diego, C...
In DepthDetails PCBioAssay
TargetApoptotic protease-activating factor 1(Homo sapiens (Human))
Burnham Center For Chemical Genomics
Curated by PubChem BioAssay
LigandPNGBDBM34692(2-Methyl-3-(4-methyl-benzoyl)-naphtho[1,2-b]furan-...)
Affinity DataIC50:  8.09E+3nM. Assay description: Data Source: Sanford-Burnham Center for Chemical Genomics (SBCCG) Source Affiliation: Sanford-Burnham Medical Research Institute (SBIMR, San Diego, C...
In DepthDetails PCBioAssay
TargetApoptotic protease-activating factor 1(Homo sapiens (Human))
Burnham Center For Chemical Genomics
Curated by PubChem BioAssay
LigandPNGBDBM34692(2-Methyl-3-(4-methyl-benzoyl)-naphtho[1,2-b]furan-...)
Affinity DataIC50: >1.00E+5nM. Assay description: Data Source: Sanford-Burnham Center for Chemical Genomics (SBCCG) Source Affiliation: Sanford-Burnham Medical Research Institute (SBIMR, San Diego, C...
In DepthDetails PCBioAssay
TargetCaspase-9(Homo sapiens (Human))
Burnham Center For Chemical Genomics
Curated by PubChem BioAssay
LigandPNGBDBM34692(2-Methyl-3-(4-methyl-benzoyl)-naphtho[1,2-b]furan-...)
Affinity DataIC50:  1.04E+4nM. Assay description: Data Source: Sanford-Burnham Center for Chemical Genomics (SBCCG) Source Affiliation: Sanford-Burnham Medical Research Institute (SBIMR, San Diego, C...
In DepthDetails PCBioAssay
TargetHepatocyte nuclear factor 4-alpha(Homo sapiens (Human))
The Scripps Research Institute Molecular Screening Center
Curated by PubChem BioAssay
LigandPNGBDBM34692(2-Methyl-3-(4-methyl-benzoyl)-naphtho[1,2-b]furan-...)
Affinity DataIC50:  5.42E+3nM
In DepthDetails PCBioAssay
TargetBeta-lactamase(Pseudomonas aeruginosa)
The Scripps Research Institute Molecular Screening Center
Curated by PubChem BioAssay
LigandPNGBDBM34692(2-Methyl-3-(4-methyl-benzoyl)-naphtho[1,2-b]furan-...)
Affinity DataIC50: >4.97E+4nM
In DepthDetails PCBioAssay
TargetPerilipin-1(Homo sapiens (Human))
The Scripps Research Institute Molecular Screening Center
Curated by PubChem BioAssay
LigandPNGBDBM34692(2-Methyl-3-(4-methyl-benzoyl)-naphtho[1,2-b]furan-...)
Affinity DataIC50:  5.40E+3nM
In DepthDetails PCBioAssay
TargetReceptor-interacting serine/threonine-protein kinase 2(Homo sapiens (Human))
The Scripps Research Institute Molecular Screening Center
Curated by PubChem BioAssay
LigandPNGBDBM34692(2-Methyl-3-(4-methyl-benzoyl)-naphtho[1,2-b]furan-...)
Affinity DataIC50:  6.83E+3nM
In DepthDetails PCBioAssay
TargetPerilipin-5(Homo sapiens (Human))
The Scripps Research Institute Molecular Screening Center
Curated by PubChem BioAssay
LigandPNGBDBM34692(2-Methyl-3-(4-methyl-benzoyl)-naphtho[1,2-b]furan-...)
Affinity DataIC50:  3.82E+3nM
In DepthDetails PCBioAssay
TargetStreptokinase A(Streptococcus pyogenes M1 GAS)
Broad Institute
Curated by PubChem BioAssay
LigandPNGBDBM34692(2-Methyl-3-(4-methyl-benzoyl)-naphtho[1,2-b]furan-...)
Affinity DataEC50:  1.50E+5nM. Assay description: Keywords: Group A streptococcus, GAS, streptokinase, expression, virulence, inhibition, dose response, EC50 Assay Overview: The goal of this assa...
In DepthDetails PCBioAssay