BDBM347032 US10202388, Compound 40
SMILES OC(Cn1c2cncn2c2ccccc12)C12CC3CC(CC(C3)C1)C2
InChI Key InChIKey=LGTXXXLWEAJOQG-UHFFFAOYSA-N
Data  1 IC50
  Tab Delimited (TSV)   2D SDfile   Computed 3D by Vconf -m prep SDfile
Find this compound or compounds like it in BindingDB:
Activity Spreadsheet -- Enzyme Inhibition Constant Data from BindingDB
Found 1 hit for monomerid = 347032
TargetIndoleamine 2,3-dioxygenase 1(Homo sapiens (Human))
Shanghai De Novo Pharmatech
US Patent
LigandPNGBDBM347032(US10202388, Compound 40)
Affinity DataIC50:  5.50E+3nM. Assay description: The compounds described in this disclosure were dissolved in 10% DMSO to predefined concentration. All of the reactions were conducted at room temper...
Ligand InfoPC cidPC sid
In DepthDetails US Patent