BDBM347048 US10202390, Example 3
SMILES CC(C)Nc1cc(ncc1-c1cnn(c1)C1CCOCC1)-c1cnc2cc(cnn12)C#N
InChI Key InChIKey=VGDZIORKWAXUFJ-UHFFFAOYSA-N
Data  1 IC50
  Tab Delimited (TSV)   2D SDfile   Computed 3D by Vconf -m prep SDfile
Find this compound or compounds like it in BindingDB:
Activity Spreadsheet -- Enzyme Inhibition Constant Data from BindingDB
Found 1 hit for monomerid = 347048
TargetG protein-activated inward rectifier potassium channel 4(Homo sapiens (Human))
Bristol-Myers Squibb
US Patent
LigandPNGBDBM347048(US10202390, Example 3)
Affinity DataIC50:  14nM. Assay description: TBD
Ligand InfoPC cidPC sid
In DepthDetails US Patent