BDBM347058 US10202390, Example 13
SMILES CC(C)Nc1cc(ncc1-n1cc(CCC(C)(C)O)nn1)-c1cnn2cc(Cl)cnc12
InChI Key InChIKey=WOKMOGOUIVJJGR-UHFFFAOYSA-N
Data  1 IC50
  Tab Delimited (TSV)   2D SDfile   Computed 3D by Vconf -m prep SDfile
Find this compound or compounds like it in BindingDB:
Activity Spreadsheet -- Enzyme Inhibition Constant Data from BindingDB
Found 1 hit for monomerid = 347058
TargetG protein-activated inward rectifier potassium channel 4(Homo sapiens (Human))
Bristol-Myers Squibb
US Patent
LigandPNGBDBM347058(US10202390, Example 13)
Affinity DataIC50:  3nM. Assay description: TBD
Ligand InfoPC cidPC sid
In DepthDetails US Patent