BDBM347078 US10202403, Compound 1003
SMILES CNC(=O)c1c(oc2ccc3OCc4ccccc4-c4ccccc4Cc3c12)-c1ccc(F)cc1
InChI Key InChIKey=WHHUUVJITWHMCB-UHFFFAOYSA-N
Data  1 EC50
  Tab Delimited (TSV)   2D SDfile   Computed 3D by Vconf -m prep SDfile
Find this compound or compounds like it in BindingDB:
Activity Spreadsheet -- Enzyme Inhibition Constant Data from BindingDB
Found 1 hit for monomerid = 347078
TargetGenome polyprotein(Hepatitis C Virus (Virus))
Bristol-Myers Squibb
US Patent
LigandPNGBDBM347078(US10202403, Compound 1003)
Affinity DataEC50:  2.84E+3nM. Assay description: An on-bead solid phase homogeneous assay was used in a 384-well format to assess NS5B inhibitors (WangY-K, Rigat K, Roberts S, and Gao M (2006) Anal ...
Ligand InfoPC cidPC sid
In DepthDetails US Patent