BDBM347116 2-(4-(isobutyl(4-isopropylphenyl)amino) phenoxy)pyrido[3,4-d]pyrimidin-4-ol::US10202381, Example 123::US10208039, Example 123
SMILES CC(C)CN(c1ccc(Oc2nc(O)c3ccncc3n2)cc1)c1ccc(cc1)C(C)C
InChI Key InChIKey=OHQHBIRPNWEWOD-UHFFFAOYSA-N
Data  1 IC50
  Tab Delimited (TSV)   2D SDfile   Computed 3D by Vconf -m prep SDfile
Find this compound or compounds like it in BindingDB:
Activity Spreadsheet -- Enzyme Inhibition Constant Data from BindingDB
Found 1 hit for monomerid = 347116
TargetLysine-specific demethylase 4C(Homo sapiens (Human))
Celgene Quanticel Research
US Patent
LigandPNGBDBM347116(2-(4-(isobutyl(4-isopropylphenyl)amino) phenoxy)py...)
Affinity DataIC50:  5.50E+3nM. Assay description: The ability of test compounds to inhibit the activity of JMJD2C was determined in 384-well plate-format under the following reaction conditions: 0.3 ...
Ligand InfoPC cidPC sid
In DepthDetails US Patent